{"text_format":"1","workbook":"xlsx","n_sheets":16,"sheets":["Painel","TD","DexPara","Seccional 1","Seccional 2","Seccional 3","Seccional 4","Seccional 5","Seccional 6","Seccional 7","Seccional 8","Seccional 9","Seccional 10","Seccional 11","Seccional 12","Checklist do processo"],"not_rendered":{"charts":0,"images":0,"macros":1,"external_links":0,"defined_names":0,"comments":0,"pivot_tables":0},"unopened":[],"bounds":{"document_bytes":16777216,"sheet_cells":100000,"rows_first":2000,"rows_last":500,"rows_between":2000,"halvings":0,"cell_chars":16384,"cell_head_chars":4096},"cells_cut":0,"cells_raw":0,"read":"whole","date_system":"1900"}

{"sheet":"Painel","index":0,"n_rows":14,"n_cols":14,"rows_kept":14,"cut":false,"hidden":false,"merged":[]}
[]
[null,"Escolha aqui a localidade da sua loja ou estabelecimento em que trabalha:"]
[]
[null,null,"Se você trabalha em São Paulo - SP, escolha o bairro de seu trabalho:",null,null,"Aqui aparecerá a seccional em que você poderá se candidatar"]
[]
[null,null,1,null,null,{"$f":"IFERROR(VLOOKUP(C6,TD!$A:$D,4,FALSE),\"\")","v":"Seccional"},null,null,null,null,null,null,null,{"$f":"VLOOKUP(F6,DexPara!D2:E13,2,FALSE)","v":{"$error":"#N/A"}}]
[]
[null,null,"Se você trabalha no Rio de Janeiro - RJ, escolha o bairro de seu trabalho:",null,null,"Aqui aparecerá a seccional em que você poderá se candidatar"]
[]
[null,null,1,null,null,{"$f":"IFERROR(VLOOKUP(C10,TD!$F:$I,4,FALSE),\"\")","v":"Seccional"},null,null,null,null,null,null,null,{"$f":"VLOOKUP(F10,DexPara!$D$2:$E$13,2,FALSE)","v":{"$error":"#N/A"}}]
[]
[null,null,"Se você trabalha em outra cidade, escolha a cidade abaixo:",null,null,"Aqui aparecerá a seccional em que você poderá se candidatar"]
[]
[null,null,1,null,null,{"$f":"IFERROR(VLOOKUP(C14,TD!$K:$M,3,FALSE),\"\")","v":"Seccional"},null,null,null,null,null,null,null,{"$f":"VLOOKUP(F14,DexPara!$D$2:$E$13,2,FALSE)","v":{"$error":"#N/A"}}]

{"sheet":"TD","index":1,"n_rows":205,"n_cols":13,"rows_kept":205,"cut":false,"hidden":true,"merged":[]}
[]
[]
[1,"Estabelecimento - Município","Escolha um bairro de São Paulo - SP","Seccional",null,1,"Estabelecimento - Município","Escolha um bairro do Rio de Janeiro - RJ","Seccional",null,1,"Escolha outra cidade","Seccional"]
[2,"3820 - SAO PAULO","ACLIMACAO","3 - SÃO PAULO CAPITAL III (Zona Norte e Central)",null,2,"3233 - RIO DE JANEIRO","ALCANTARA","9 - RIO DE JANEIRO III (Demais localidades)",null,2,"ANANINDEUA","12 - CENTRO OESTE / NORTE / MG / ES"]
[3,null,"ALTO DA LAPA","1 - SÃO PAULO CAPITAL I \n(Zona Oeste)",null,3,null,"ALTO DA SERRA","9 - RIO DE JANEIRO III (Demais localidades)",null,3,"ANAPOLIS","12 - CENTRO OESTE / NORTE / MG / ES"]
[4,null,"ALTO DA MOOCA","2 - SÃO PAULO CAPITAL II (Zona Leste e Sul)",null,4,null,"ARSENAL","9 - RIO DE JANEIRO III (Demais localidades)",null,4,"ARACAJU","10 - NORDESTE I\n(Bahia, Pernambuco, Sergipe e Alagoas)"]
[5,null,"ALTO DE PINHEIROS","1 - SÃO PAULO CAPITAL I \n(Zona Oeste)",null,5,null,"BANGU","7 - RIO DE JANEIRO I \n(Centro e Tijuca)",null,5,"ARACATUBA","6 - SÃO PAULO INTERIOR E PARANÁ"]
[6,null,"BARRA FUNDA","3 - SÃO PAULO CAPITAL III (Zona Norte e Central)",null,6,null,"BARRA DA TIJUCA","7 - RIO DE JANEIRO I \n(Centro e Tijuca)",null,6,"ARAPIRACA","10 - NORDESTE I\n(Bahia, Pernambuco, Sergipe e Alagoas)"]
[7,null,"BELA ALIANCA","1 - SÃO PAULO CAPITAL I \n(Zona Oeste)",null,7,null,"BENFICA","9 - RIO DE JANEIRO III (Demais localidades)",null,7,"ARARAQUARA","6 - SÃO PAULO INTERIOR E PARANÁ"]
[8,null,"BELA VISTA","3 - SÃO PAULO CAPITAL III (Zona Norte e Central)",null,8,null,"BENTO RIBEIRO","9 - RIO DE JANEIRO III (Demais localidades)",null,8,"ARUJA","4 - GRANDE SÃO PAULO \n(Abc, Guarulhos, Osasco, e demais localidades)"]
[9,null,"BELENZINHO","2 - SÃO PAULO CAPITAL II (Zona Leste e Sul)",null,9,null,"BNH","9 - RIO DE JANEIRO III (Demais localidades)",null,9,"ASSIS","6 - SÃO PAULO INTERIOR E PARANÁ"]
[10,null,"BOM RETIRO","3 - SÃO PAULO CAPITAL III (Zona Norte e Central)",null,10,null,"BOTAFOGO","8 - RIO DE JANEIRO II\n(Zona Sul)",null,10,"ATIBAIA","6 - SÃO PAULO INTERIOR E PARANÁ"]
[11,null,"BOSQUE DA SAUDE","2 - SÃO PAULO CAPITAL II (Zona Leste e Sul)",null,11,null,"CABANAS DEBUZIOS","9 - RIO DE JANEIRO III (Demais localidades)",null,11,"AVARE","6 - SÃO PAULO INTERIOR E PARANÁ"]
[12,null,"BROOKLIN NOVO","2 - SÃO PAULO CAPITAL II (Zona Leste e Sul)",null,12,null,"CAMPO GRANDE","7 - RIO DE JANEIRO I \n(Centro e Tijuca)",null,12,"BARREIRAS","10 - NORDESTE I\n(Bahia, Pernambuco, Sergipe e Alagoas)"]
[13,null,"BROOKLIN PAULISTA","2 - SÃO PAULO CAPITAL II (Zona Leste e Sul)",null,13,null,"CATETE","8 - RIO DE JANEIRO II\n(Zona Sul)",null,13,"BARUERI","4 - GRANDE SÃO PAULO \n(Abc, Guarulhos, Osasco, e demais localidades)"]
[14,null,"BUTANTA","1 - SÃO PAULO CAPITAL I \n(Zona Oeste)",null,14,null,"CENTRO ARARUAMA","9 - RIO DE JANEIRO III (Demais localidades)",null,14,"BAURU","6 - SÃO PAULO INTERIOR E PARANÁ"]
[15,null,"CAMBUCI","3 - SÃO PAULO CAPITAL III (Zona Norte e Central)",null,15,null,"CENTRO CABO FRIO","9 - RIO DE JANEIRO III (Demais localidades)",null,15,"BEBEDOURO","6 - SÃO PAULO INTERIOR E PARANÁ"]
[16,null,"CAMPO BELO","2 - SÃO PAULO CAPITAL II (Zona Leste e Sul)",null,16,null,"CENTRO MACAE","9 - RIO DE JANEIRO III (Demais localidades)",null,16,"BELEM","12 - CENTRO OESTE / NORTE / MG / ES"]
[17,null,"CAMPOS ELISEOS","3 - SÃO PAULO CAPITAL III (Zona Norte e Central)",null,17,null,"CENTRO NILOPOLIS","7 - RIO DE JANEIRO I \n(Centro e Tijuca)",null,17,"BELO HORIZONTE","12 - CENTRO OESTE / NORTE / MG / ES"]
[18,null,"CANGAIBA","2 - SÃO PAULO CAPITAL II (Zona Leste e Sul)",null,18,null,"CENTRO NITEROI","9 - RIO DE JANEIRO III (Demais localidades)",null,18,"BERTIOGA","5 - SÃO PAULO BAIXADA E VALE DO PARAÍBA"]
[19,null,"CARANDIRU","3 - SÃO PAULO CAPITAL III (Zona Norte e Central)",null,19,null,"CENTRO NOVA IGUACU","9 - RIO DE JANEIRO III (Demais localidades)",null,19,"BETIM","12 - CENTRO OESTE / NORTE / MG / ES"]
[20,null,"CASA VERDE","3 - SÃO PAULO CAPITAL III (Zona Norte e Central)",null,20,null,"CENTRO PETROPOLIS","9 - RIO DE JANEIRO III (Demais localidades)",null,20,"BOA VISTA","12 - CENTRO OESTE / NORTE / MG / ES"]
[21,null,"CENTRO","3 - SÃO PAULO CAPITAL III (Zona Norte e Central)",null,21,null,"CENTRO QUEIMADOS","9 - RIO DE JANEIRO III (Demais localidades)",null,21,"BOITUVA","6 - SÃO PAULO INTERIOR E PARANÁ"]
[22,null,"CERQUEIRA CESAR","3 - SÃO PAULO CAPITAL III (Zona Norte e Central)",null,22,null,"CENTRO RIO DE JANEIRO","7 - RIO DE JANEIRO I \n(Centro e Tijuca)",null,22,"BOTUCATU","6 - SÃO PAULO INTERIOR E PARANÁ"]
[23,null,"CHACARA BELENZINHO","2 - SÃO PAULO CAPITAL II (Zona Leste e Sul)",null,23,null,"CENTRO SAO GONCALO","9 - RIO DE JANEIRO III (Demais localidades)",null,23,"BRASILIA","12 - CENTRO OESTE / NORTE / MG / ES"]
[24,null,"CHACARA SANTO ANTONIO (ZONA SUL)","2 - SÃO PAULO CAPITAL II (Zona Leste e Sul)",null,24,null,"CENTRO SAO JOAO DE MERITI","9 - RIO DE JANEIRO III (Demais localidades)",null,24,"BROTAS","6 - SÃO PAULO INTERIOR E PARANÁ"]
[25,null,"CIDADE ADEMAR","2 - SÃO PAULO CAPITAL II (Zona Leste e Sul)",null,25,null,"CENTRO SAO PEDRO DA ALDEIA","9 - RIO DE JANEIRO III (Demais localidades)",null,25,"CABEDELO","11 - NORDESTE II\n(Rio Grande do Norte, Ceará, Piauí, e Paraíba)"]
[26,null,"CIDADE DUTRA","2 - SÃO PAULO CAPITAL II (Zona Leste e Sul)",null,26,null,"COELHO NETO","9 - RIO DE JANEIRO III (Demais localidades)",null,26,"CABO DE SANTO AGOSTINHO","10 - NORDESTE I\n(Bahia, Pernambuco, Sergipe e Alagoas)"]
[27,null,"CIDADE JARDIM","1 - SÃO PAULO CAPITAL I \n(Zona Oeste)",null,27,null,"COPACABANA","8 - RIO DE JANEIRO II\n(Zona Sul)",null,27,"CACAPAVA","6 - SÃO PAULO INTERIOR E PARANÁ"]
[28,null,"CIDADE MAE DO CEU","2 - SÃO PAULO CAPITAL II (Zona Leste e Sul)",null,28,null,"CORDOVIL","9 - RIO DE JANEIRO III (Demais localidades)",null,28,"CAJAMAR","4 - GRANDE SÃO PAULO \n(Abc, Guarulhos, Osasco, e demais localidades)"]
[29,null,"CIDADE MONCOES","2 - SÃO PAULO CAPITAL II (Zona Leste e Sul)",null,29,null,"CORREAS","9 - RIO DE JANEIRO III (Demais localidades)",null,29,"CALDAS NOVAS","12 - CENTRO OESTE / NORTE / MG / ES"]
[30,null,"CITY AMERICA","3 - SÃO PAULO CAPITAL III (Zona Norte e Central)",null,30,null,"ENGENHO DE DENTRO","9 - RIO DE JANEIRO III (Demais localidades)",null,30,"CAMACARI","10 - NORDESTE I\n(Bahia, Pernambuco, Sergipe e Alagoas)"]
[31,null,"CONJUNTO HABITACIONAL PADRE JOSE DE ANCHIETA","2 - SÃO PAULO CAPITAL II (Zona Leste e Sul)",null,31,null,"FLAMENGO","8 - RIO DE JANEIRO II\n(Zona Sul)",null,31,"CAMARAGIBE","10 - NORDESTE I\n(Bahia, Pernambuco, Sergipe e Alagoas)"]
[32,null,"CONJUNTO RESIDENCIAL JOSE BONIFACIO","2 - SÃO PAULO CAPITAL II (Zona Leste e Sul)",null,32,null,"FREGUESIA (JACAREPAGUA)","9 - RIO DE JANEIRO III (Demais localidades)",null,32,"CAMPINA GRANDE","11 - NORDESTE II\n(Rio Grande do Norte, Ceará, Piauí, e Paraíba)"]
[33,null,"CONSOLACAO","3 - SÃO PAULO CAPITAL III (Zona Norte e Central)",null,33,null,"ICARAI","9 - RIO DE JANEIRO III (Demais localidades)",null,33,"CAMPINAS","6 - SÃO PAULO INTERIOR E PARANÁ"]
[34,null,"ERMELINO MATARAZZO","2 - SÃO PAULO CAPITAL II (Zona Leste e Sul)",null,34,null,"INGA","9 - RIO DE JANEIRO III (Demais localidades)",null,34,"CAMPO GRANDE","12 - CENTRO OESTE / NORTE / MG / ES"]
[35,null,"GUAIANAZES","2 - SÃO PAULO CAPITAL II (Zona Leste e Sul)",null,35,null,"ITAIPAVA","9 - RIO DE JANEIRO III (Demais localidades)",null,35,"CAMPOS DO JORDAO","6 - SÃO PAULO INTERIOR E PARANÁ"]
[36,null,"HIGIENOPOLIS","3 - SÃO PAULO CAPITAL III (Zona Norte e Central)",null,36,null,"JACAREPAGUA","9 - RIO DE JANEIRO III (Demais localidades)",null,36,"CARAGUATATUBA","5 - SÃO PAULO BAIXADA E VALE DO PARAÍBA"]
[37,null,"IMIRIM","3 - SÃO PAULO CAPITAL III (Zona Norte e Central)",null,37,null,"JARDIM BOTANICO","8 - RIO DE JANEIRO II\n(Zona Sul)",null,37,"CARAPICUIBA","4 - GRANDE SÃO PAULO \n(Abc, Guarulhos, Osasco, e demais localidades)"]
[38,null,"INDIANOPOLIS","2 - SÃO PAULO CAPITAL II (Zona Leste e Sul)",null,38,null,"JARDIM CAMPOMAR","9 - RIO DE JANEIRO III (Demais localidades)",null,38,"CARUARU","10 - NORDESTE I\n(Bahia, Pernambuco, Sergipe e Alagoas)"]
[39,null,"IPIRANGA","3 - SÃO PAULO CAPITAL III (Zona Norte e Central)",null,39,null,"JARDIM CARIOCA","9 - RIO DE JANEIRO III (Demais localidades)",null,39,"CASTANHAL","12 - CENTRO OESTE / NORTE / MG / ES"]
[40,null,"ITABERABA","3 - SÃO PAULO CAPITAL III (Zona Norte e Central)",null,40,null,"JARDIM EXCELSIOR","9 - RIO DE JANEIRO III (Demais localidades)",null,40,"CAUCAIA","11 - NORDESTE II\n(Rio Grande do Norte, Ceará, Piauí, e Paraíba)"]
[41,null,"ITAIM BIBI","1 - SÃO PAULO CAPITAL I \n(Zona Oeste)",null,41,null,"JARDIM JOSE BONIFACIO","9 - RIO DE JANEIRO III (Demais localidades)",null,41,"CONTAGEM","12 - CENTRO OESTE / NORTE / MG / ES"]
[42,null,"ITAQUERA","2 - SÃO PAULO CAPITAL II (Zona Leste e Sul)",null,42,null,"LEBLON","8 - RIO DE JANEIRO II\n(Zona Sul)",null,42,"COTIA","4 - GRANDE SÃO PAULO \n(Abc, Guarulhos, Osasco, e demais localidades)"]
[43,null,"JABAQUARA","2 - SÃO PAULO CAPITAL II (Zona Leste e Sul)",null,43,null,"LINDO PARQUE","9 - RIO DE JANEIRO III (Demais localidades)",null,43,"CUBATAO","5 - SÃO PAULO BAIXADA E VALE DO PARAÍBA"]
[44,null,"JAGUARE","1 - SÃO PAULO CAPITAL I \n(Zona Oeste)",null,44,null,"MADUREIRA","9 - RIO DE JANEIRO III (Demais localidades)",null,44,"CUIABA","12 - CENTRO OESTE / NORTE / MG / ES"]
[45,null,"JARDIM ALZIRA","2 - SÃO PAULO CAPITAL II (Zona Leste e Sul)",null,45,null,"MARACANA","9 - RIO DE JANEIRO III (Demais localidades)",null,45,"CURITIBA","6 - SÃO PAULO INTERIOR E PARANÁ"]
[46,null,"JARDIM AMERICA","1 - SÃO PAULO CAPITAL I \n(Zona Oeste)",null,46,null,"MEIER","9 - RIO DE JANEIRO III (Demais localidades)",null,46,"DIADEMA","4 - GRANDE SÃO PAULO \n(Abc, Guarulhos, Osasco, e demais localidades)"]
[47,null,"JARDIM AMERICA DA PENHA","2 - SÃO PAULO CAPITAL II (Zona Leste e Sul)",null,47,null,"PACIENCIA","7 - RIO DE JANEIRO I \n(Centro e Tijuca)",null,47,"DOURADOS","12 - CENTRO OESTE / NORTE / MG / ES"]
[48,null,"JARDIM AMPLIACAO","2 - SÃO PAULO CAPITAL II (Zona Leste e Sul)",null,48,null,"PARQUE CALIFORNIA","9 - RIO DE JANEIRO III (Demais localidades)",null,48,"EMBU DAS ARTES","4 - GRANDE SÃO PAULO \n(Abc, Guarulhos, Osasco, e demais localidades)"]
[49,null,"JARDIM BRASIL (ZONA NORTE)","3 - SÃO PAULO CAPITAL III (Zona Norte e Central)",null,49,null,"PARQUE SANTO AMARO","9 - RIO DE JANEIRO III (Demais localidades)",null,49,"EMBU-GUACU","6 - SÃO PAULO INTERIOR E PARANÁ"]
[50,null,"JARDIM CASA GRANDE","2 - SÃO PAULO CAPITAL II (Zona Leste e Sul)",null,50,null,"PENHA","9 - RIO DE JANEIRO III (Demais localidades)",null,50,"FEIRA DE SANTANA","10 - NORDESTE I\n(Bahia, Pernambuco, Sergipe e Alagoas)"]
[51,null,"JARDIM COTINHA","2 - SÃO PAULO CAPITAL II (Zona Leste e Sul)",null,51,null,"PENHA CIRCULAR","9 - RIO DE JANEIRO III (Demais localidades)",null,51,"FORTALEZA","11 - NORDESTE II\n(Rio Grande do Norte, Ceará, Piauí, e Paraíba)"]
[52,null,"JARDIM DAS FLORES","2 - SÃO PAULO CAPITAL II (Zona Leste e Sul)",null,52,null,"PIABETA (INHOMIRIM)","9 - RIO DE JANEIRO III (Demais localidades)",null,52,"FOZ DO IGUACU","6 - SÃO PAULO INTERIOR E PARANÁ"]
[53,null,"JARDIM ESTER YOLANDA","1 - SÃO PAULO CAPITAL I \n(Zona Oeste)",null,53,null,"PILARES","9 - RIO DE JANEIRO III (Demais localidades)",null,53,"FRANCO DA ROCHA","4 - GRANDE SÃO PAULO \n(Abc, Guarulhos, Osasco, e demais localidades)"]
[54,null,"JARDIM FLORESTA","2 - SÃO PAULO CAPITAL II (Zona Leste e Sul)",null,54,null,"PIRATININGA","9 - RIO DE JANEIRO III (Demais localidades)",null,54,"GARANHUNS","10 - NORDESTE I\n(Bahia, Pernambuco, Sergipe e Alagoas)"]
[55,null,"JARDIM HELENA","2 - SÃO PAULO CAPITAL II (Zona Leste e Sul)",null,55,null,"PORTO VELHO","9 - RIO DE JANEIRO III (Demais localidades)",null,55,"GOIANIA","12 - CENTRO OESTE / NORTE / MG / ES"]
[56,null,"JARDIM ITAPEMIRIM","2 - SÃO PAULO CAPITAL II (Zona Leste e Sul)",null,56,null,"PORTUGUESA","9 - RIO DE JANEIRO III (Demais localidades)",null,56,"GUAIRA","6 - SÃO PAULO INTERIOR E PARANÁ"]
[57,null,"JARDIM ITAPEVA","2 - SÃO PAULO CAPITAL II (Zona Leste e Sul)",null,57,null,"QUITANDINHA","9 - RIO DE JANEIRO III (Demais localidades)",null,57,"GUANAMBI","10 - NORDESTE I\n(Bahia, Pernambuco, Sergipe e Alagoas)"]
[58,null,"JARDIM JARAGUA","3 - SÃO PAULO CAPITAL III (Zona Norte e Central)",null,58,null,"RAUL VEIGA","9 - RIO DE JANEIRO III (Demais localidades)",null,58,"GUARATINGUETA","5 - SÃO PAULO BAIXADA E VALE DO PARAÍBA"]
[59,null,"JARDIM LIDER","3 - SÃO PAULO CAPITAL III (Zona Norte e Central)",null,59,null,"RIO COMPRIDO","7 - RIO DE JANEIRO I \n(Centro e Tijuca)",null,59,"GUARUJA","5 - SÃO PAULO BAIXADA E VALE DO PARAÍBA"]
[60,null,"JARDIM MONTE ALEGRE (ZONA NORTE)","3 - SÃO PAULO CAPITAL III (Zona Norte e Central)",null,60,null,"RIO DO LIMAO","9 - RIO DE JANEIRO III (Demais localidades)",null,60,"GUARULHOS","4 - GRANDE SÃO PAULO \n(Abc, Guarulhos, Osasco, e demais localidades)"]
[61,null,"JARDIM MONTE KEMEL","1 - SÃO PAULO CAPITAL I \n(Zona Oeste)",null,61,null,"RIVIERA FLUMINENSE","9 - RIO DE JANEIRO III (Demais localidades)",null,61,"HORTOLANDIA","6 - SÃO PAULO INTERIOR E PARANÁ"]
[62,null,"JARDIM MORUMBI","1 - SÃO PAULO CAPITAL I \n(Zona Oeste)",null,62,null,"ROCHA MIRANDA","9 - RIO DE JANEIRO III (Demais localidades)",null,62,"IGUATU","11 - NORDESTE II\n(Rio Grande do Norte, Ceará, Piauí, e Paraíba)"]
[63,null,"JARDIM PARAISO","3 - SÃO PAULO CAPITAL III (Zona Norte e Central)",null,63,null,"ROSEIRAL","9 - RIO DE JANEIRO III (Demais localidades)",null,63,"ILHEUS","10 - NORDESTE I\n(Bahia, Pernambuco, Sergipe e Alagoas)"]
[64,null,"JARDIM PAULISTA","1 - SÃO PAULO CAPITAL I \n(Zona Oeste)",null,64,null,"SANTA CRUZ","7 - RIO DE JANEIRO I \n(Centro e Tijuca)",null,64,"IMPERATRIZ","11 - NORDESTE II\n(Rio Grande do Norte, Ceará, Piauí, e Paraíba)"]
[65,null,"JARDIM PAULISTANO","1 - SÃO PAULO CAPITAL I \n(Zona Oeste)",null,65,null,"SANTANA","9 - RIO DE JANEIRO III (Demais localidades)",null,65,"INDAIATUBA","6 - SÃO PAULO INTERIOR E PARANÁ"]
[66,null,"JARDIM PINHEIROS","1 - SÃO PAULO CAPITAL I \n(Zona Oeste)",null,66,null,"SANTO ANTONIO DA SERRA","9 - RIO DE JANEIRO III (Demais localidades)",null,66,"IPATINGA","12 - CENTRO OESTE / NORTE / MG / ES"]
[67,null,"JARDIM PLANALTO","2 - SÃO PAULO CAPITAL II (Zona Leste e Sul)",null,67,null,"SAO BENTO","9 - RIO DE JANEIRO III (Demais localidades)",null,67,"ITABAIANA","10 - NORDESTE I\n(Bahia, Pernambuco, Sergipe e Alagoas)"]
[68,null,"JARDIM PRUDENCIA","2 - SÃO PAULO CAPITAL II (Zona Leste e Sul)",null,68,null,"SAO CRISTOVAO - CABO FRIO","9 - RIO DE JANEIRO III (Demais localidades)",null,68,"ITAITINGA","11 - NORDESTE II\n(Rio Grande do Norte, Ceará, Piauí, e Paraíba)"]
[69,null,"JARDIM RINCAO","3 - SÃO PAULO CAPITAL III (Zona Norte e Central)",null,69,null,"SAO CRISTOVAO - RIO DE JANEIRO","7 - RIO DE JANEIRO I \n(Centro e Tijuca)",null,69,"ITANHAEM","5 - SÃO PAULO BAIXADA E VALE DO PARAÍBA"]
[70,null,"JARDIM SANTA TEREZINHA (ZONA LESTE)","2 - SÃO PAULO CAPITAL II (Zona Leste e Sul)",null,70,null,"TIJUCA","9 - RIO DE JANEIRO III (Demais localidades)",null,70,"ITAPECERICA DA SERRA","6 - SÃO PAULO INTERIOR E PARANÁ"]
[71,null,"JARDIM SANTO ELIAS","3 - SÃO PAULO CAPITAL III (Zona Norte e Central)",null,71,null,"VARZEA","9 - RIO DE JANEIRO III (Demais localidades)",null,71,"ITAPETINGA","10 - NORDESTE I\n(Bahia, Pernambuco, Sergipe e Alagoas)"]
[72,null,"JARDIM SAO BERNARDO","2 - SÃO PAULO CAPITAL II (Zona Leste e Sul)",null,72,null,"VILA CENTENARIO","9 - RIO DE JANEIRO III (Demais localidades)",null,72,"ITAPETININGA","6 - SÃO PAULO INTERIOR E PARANÁ"]
[73,null,"JARDIM SAO LUIS","2 - SÃO PAULO CAPITAL II (Zona Leste e Sul)",null,73,null,"VILA DA PENHA","9 - RIO DE JANEIRO III (Demais localidades)",null,73,"ITAPEVI","4 - GRANDE SÃO PAULO \n(Abc, Guarulhos, Osasco, e demais localidades)"]
[74,null,"JARDIM SAO NICOLAU","2 - SÃO PAULO CAPITAL II (Zona Leste e Sul)",null,74,null,"VILA ISABEL","9 - RIO DE JANEIRO III (Demais localidades)",null,74,"ITAQUAQUECETUBA","4 - GRANDE SÃO PAULO \n(Abc, Guarulhos, Osasco, e demais localidades)"]
[75,null,"JARDIM TAQUARAL","2 - SÃO PAULO CAPITAL II (Zona Leste e Sul)",null,75,null,"VILA VALQUEIRE","7 - RIO DE JANEIRO I \n(Centro e Tijuca)",null,75,"ITATIBA","6 - SÃO PAULO INTERIOR E PARANÁ"]
[76,null,"JARDIM TRES MARIAS","2 - SÃO PAULO CAPITAL II (Zona Leste e Sul)",null,76,null,"VIRGEM SANTA","9 - RIO DE JANEIRO III (Demais localidades)",null,76,"ITU","6 - SÃO PAULO INTERIOR E PARANÁ"]
[77,null,"JARDIM VILA MARIANA","2 - SÃO PAULO CAPITAL II (Zona Leste e Sul)",null,77,null,"VISTA ALEGRE","9 - RIO DE JANEIRO III (Demais localidades)",null,77,"JABOATAO DOS GUARARAPES","10 - NORDESTE I\n(Bahia, Pernambuco, Sergipe e Alagoas)"]
[78,null,"LAPA","1 - SÃO PAULO CAPITAL I \n(Zona Oeste)",null,78,null,null,null,null,78,"JANDIRA","4 - GRANDE SÃO PAULO \n(Abc, Guarulhos, Osasco, e demais localidades)"]
{"$rows_left_out":126}
{"sheet":"DexPara","index":2,"n_rows":13,"n_cols":5,"rows_kept":13,"cut":false,"hidden":true,"merged":[]}
[]
[null,null,null,"1 - SÃO PAULO CAPITAL I \n(Zona Oeste)","Seccional 1"]
[null,null,null,"2 - SÃO PAULO CAPITAL II\n(Zona Leste e Sul)","Seccional 2"]
[null,null,null,"3 - SÃO PAULO CAPITAL III (Zona Norte e Central)","Seccional 3"]
[null,null,null,"4 - GRANDE SÃO PAULO \n(Abc, Guarulhos, Osasco, e demais localidades)","Seccional 4"]
[null,null,null,"5 - SÃO PAULO BAIXADA E VALE DO PARAÍBA","Seccional 5"]
[null,null,null,"6 - SÃO PAULO INTERIOR E PARANÁ","Seccional 6"]
[null,null,null,"7 - RIO DE JANEIRO I \n(Centro e Tijuca)","Seccional 7"]
[null,null,null,"8 - RIO DE JANEIRO II\n(Zona Sul)","Seccional 8"]
[null,null,null,"9 - RIO DE JANEIRO III\n(Demais localidades)","Seccional 9"]
[null,null,null,"10 - NORDESTE I\n(Bahia, Pernambuco, Sergipe e Alagoas)","Seccional 10"]
[null,null,null,"11 - NORDESTE II\n(Rio Grande do Norte, Ceará, Piauí, e Paraíba)","Seccional 11"]
[null,null,null,"12 - CENTRO OESTE / NORTE / MG / ES","Seccional 12"]

{"sheet":"Seccional 1","index":3,"n_rows":4,"n_cols":4,"rows_kept":4,"cut":false,"hidden":true,"merged":[[1,1,1,3],[2,1,2,3],[1,4,2,4]]}
[]
[null,"Seccional 1 - SÃO PAULO CAPITAL I"]
[null,"(Zona Oeste)"]
[null,"nº chapa","Efetivo","Suplente"]

{"sheet":"Seccional 2","index":4,"n_rows":4,"n_cols":4,"rows_kept":4,"cut":false,"hidden":true,"merged":[[2,1,2,3],[1,1,1,3]]}
[]
[null,"Seccional 2 - SÃO PAULO CAPITAL II"]
[null,"(Zona Leste e Sul)"]
[null,"nº chapa","Efetivo","Suplente"]

{"sheet":"Seccional 3","index":5,"n_rows":4,"n_cols":4,"rows_kept":4,"cut":false,"hidden":true,"merged":[[1,1,1,3],[2,1,2,3]]}
[]
[null,"3 - SÃO PAULO CAPITAL III"]
[null,"(Zona Norte e Central)"]
[null,"nº chapa","Efetivo","Suplente"]

{"sheet":"Seccional 4","index":6,"n_rows":4,"n_cols":4,"rows_kept":4,"cut":false,"hidden":true,"merged":[[1,1,1,3],[2,1,2,3]]}
[]
[null,"4 - GRANDE SÃO PAULO"]
[null,"(ABC, Guarulhos, Osasco, e demais localidades)"]
[null,"nº chapa","Efetivo","Suplente"]

{"sheet":"Seccional 5","index":7,"n_rows":3,"n_cols":4,"rows_kept":3,"cut":false,"hidden":true,"merged":[[1,1,1,3],[1,4,2,4]]}
[]
[null,"5 - SÃO PAULO BAIXADA E VALE DO PARAÍBA"]
[null,"nº chapa","Efetivo","Suplente"]

{"sheet":"Seccional 6","index":8,"n_rows":4,"n_cols":4,"rows_kept":4,"cut":false,"hidden":true,"merged":[[2,1,2,3]]}
[]
[]
[null,"6 - SÃO PAULO INTERIOR E PARANÁ"]
[null,"nº chapa","Efetivo","Suplente"]

{"sheet":"Seccional 7","index":9,"n_rows":4,"n_cols":4,"rows_kept":4,"cut":false,"hidden":true,"merged":[[1,1,1,3],[2,1,2,3]]}
[]
[null,"7 - RIO DE JANEIRO I"]
[null,"(Centro e Tijuca)"]
[null,"nº chapa","Efetivo","Suplente"]

{"sheet":"Seccional 8","index":10,"n_rows":4,"n_cols":4,"rows_kept":4,"cut":false,"hidden":true,"merged":[[1,0,2,0],[1,1,1,3],[2,1,2,3]]}
[]
[null,"8 - RIO DE JANEIRO II"]
[null,"(Zona Sul)"]
[null,"nº chapa","Efetivo","Suplente"]

{"sheet":"Seccional 9","index":11,"n_rows":4,"n_cols":4,"rows_kept":4,"cut":false,"hidden":true,"merged":[[2,1,2,3],[1,1,1,3]]}
[]
[null,"9 - RIO DE JANEIRO III"]
[null,"(Demais localidades)"]
[null,"nº chapa","Efetivo","Suplente"]

{"sheet":"Seccional 10","index":12,"n_rows":4,"n_cols":4,"rows_kept":4,"cut":false,"hidden":true,"merged":[[1,1,1,3],[2,1,2,3]]}
[]
[null,"10 - NORDESTE I"]
[null,"(Bahia, Pernambuco, Sergipe e Alagoas)"]
[null,"nº chapa","Efetivo","Suplente"]

{"sheet":"Seccional 11","index":13,"n_rows":4,"n_cols":4,"rows_kept":4,"cut":false,"hidden":true,"merged":[[1,0,2,0],[1,1,1,3],[2,1,2,3]]}
[]
[null,"11 - NORDESTE II"]
[null,"(Rio Grande do Norte, Ceará, Piauí, e Paraíba)"]
[null,"nº chapa","Efetivo","Suplente"]

{"sheet":"Seccional 12","index":14,"n_rows":3,"n_cols":4,"rows_kept":3,"cut":false,"hidden":true,"merged":[[1,0,2,0],[1,1,1,3]]}
[]
[null,"12 - CENTRO OESTE / NORTE / MG / ES"]
[null,"nº chapa","Efetivo","Suplente"]

{"sheet":"Checklist do processo","index":15,"n_rows":7,"n_cols":1,"rows_kept":7,"cut":false,"hidden":true,"merged":[]}
["Checklist do Processo"]
["Base de ativos"]
["pegar Bairro estabelecimento, cidade estabelecimento, estado estabelecimento, e cep estabelecimento"]
["tirar bairros e cidades duplicadas"]
["proc de bairro e cidade com a lista de seccionais da eleição anterior para trazer nome da seccional por bairro e cidade"]
["tratar manualmente casos N/D"]
["Colocar lista no layout da pesquisa de seccional"]