{"text_format":"1","workbook":"xlsx","n_sheets":2,"sheets":["Painel","TD"],"not_rendered":{"charts":0,"images":0,"macros":1,"external_links":0,"defined_names":1,"comments":0,"pivot_tables":0},"unopened":[],"bounds":{"document_bytes":16777216,"sheet_cells":100000,"rows_first":2000,"rows_last":500,"rows_between":2000,"halvings":0,"cell_chars":16384,"cell_head_chars":4096},"cells_cut":0,"cells_raw":0,"read":"whole","date_system":"1900"}

{"sheet":"Painel","index":0,"n_rows":14,"n_cols":14,"rows_kept":14,"cut":false,"hidden":false,"merged":[]}
[]
[null,"Escolha aqui a localidade da sua loja ou estabelecimento em que trabalha:"]
[]
[null,null,"Se você trabalha em São Paulo - SP, escolha o bairro de seu trabalho:",null,null,"Aqui aparecerá a seccional em que você poderá se candidatar"]
[]
[null,null,1,null,null,{"$f":"IFERROR(VLOOKUP(C6,TD!$A:$D,4,FALSE),\"\")","v":"Seccional"},null,null,null,null,null,null,null,{"$f":"VLOOKUP(F6,#REF!,2,FALSE)","v":{"$error":"#REF!"}}]
[]
[null,null,"Se você trabalha no Rio de Janeiro - RJ, escolha o bairro de seu trabalho:",null,null,"Aqui aparecerá a seccional em que você poderá se candidatar"]
[]
[null,null,1,null,null,{"$f":"IFERROR(VLOOKUP(C10,TD!$F:$I,4,FALSE),\"\")","v":"Seccional"},null,null,null,null,null,null,null,{"$f":"VLOOKUP(F10,#REF!,2,FALSE)","v":{"$error":"#REF!"}}]
[]
[null,null,"Se você trabalha em outra cidade, escolha a cidade abaixo:",null,null,"Aqui aparecerá a seccional em que você poderá se candidatar"]
[]
[null,null,1,null,null,{"$f":"IFERROR(VLOOKUP(C14,TD!$K:$M,3,FALSE),\"\")","v":"Seccional"},null,null,null,null,null,null,null,{"$f":"VLOOKUP(F14,#REF!,2,FALSE)","v":{"$error":"#REF!"}}]

{"sheet":"TD","index":1,"n_rows":233,"n_cols":13,"rows_kept":233,"cut":false,"hidden":true,"merged":[]}
[]
[]
[1,"Estabelecimento - Município","Escolha um bairro de São Paulo - SP","Seccional",null,1,"Estabelecimento - Município","Escolha um bairro do Rio de Janeiro - RJ","Seccional",null,1,"Escolha outra cidade","Seccional"]
[2,"3820 - SAO PAULO","ACLIMACAO","3 - SÃO PAULO CAPITAL III\n(Zona Norte e Central)",null,2,"3233 - RIO DE JANEIRO","BARRA DA TIJUCA","7 - RIO DE JANEIRO I \n(Centro e Tijuca)",null,2,"ALBERNESIA","6 - SÃO PAULO INTERIOR E PARANÁ"]
[3,null,"ALTO DA LAPA","1 - SÃO PAULO CAPITAL I \n(Zona Oeste)",null,3,null,"BENTO RIBEIRO","9 - RIO DE JANEIRO III\n(Demais localidades)",null,3,"ALDEOTA","11 - NORDESTE II\n(Rio Grande do Norte, Ceará, Piauí, e Paraíba)"]
[4,null,"ALTO DA MOOCA","2 - SÃO PAULO CAPITAL II\n(Zona Leste e Sul)",null,4,null,"BOTAFOGO","8 - RIO DE JANEIRO II\n(Zona Sul)",null,4,"ALEM PONTE","6 - SÃO PAULO INTERIOR E PARANÁ"]
[5,null,"ALTO DE PINHEIROS","1 - SÃO PAULO CAPITAL I \n(Zona Oeste)",null,5,null,"CABANAS DEBUZIOS","9 - RIO DE JANEIRO III\n(Demais localidades)",null,5,"ALPHAVILLE","4 - GRANDE SÃO PAULO \n(Abc, Guarulhos, Osasco, e demais localidades)"]
[6,null,"BARRA FUNDA","3 - SÃO PAULO CAPITAL III\n(Zona Norte e Central)",null,6,null,"CATETE","8 - RIO DE JANEIRO II\n(Zona Sul)",null,6,"ALPHAVILLE CENTRO INDUSTRIAL E EMPRESARIAL/ALPHAVILLE.","4 - GRANDE SÃO PAULO \n(Abc, Guarulhos, Osasco, e demais localidades)"]
[7,null,"BELA ALIANCA","1 - SÃO PAULO CAPITAL I \n(Zona Oeste)",null,7,null,"CENTRO","9 - RIO DE JANEIRO III\n(Demais localidades)",null,7,"ALPHAVILLE EMPRESARIAL","4 - GRANDE SÃO PAULO \n(Abc, Guarulhos, Osasco, e demais localidades)"]
[8,null,"BELA VISTA","3 - SÃO PAULO CAPITAL III\n(Zona Norte e Central)",null,8,null,"COPACABANA","8 - RIO DE JANEIRO II\n(Zona Sul)",null,8,"ALPHAVILLE NOVA ESPLANADA","6 - SÃO PAULO INTERIOR E PARANÁ"]
[9,null,"BELENZINHO","2 - SÃO PAULO CAPITAL II\n(Zona Leste e Sul)",null,9,null,"CORREAS","9 - RIO DE JANEIRO III\n(Demais localidades)",null,9,"ALTO DO CARDOSO","5 - SÃO PAULO BAIXADA E VALE DO PARAÍBA"]
[10,null,"BOM RETIRO","3 - SÃO PAULO CAPITAL III\n(Zona Norte e Central)",null,10,null,"FLAMENGO","8 - RIO DE JANEIRO II\n(Zona Sul)",null,10,"ALVINOPOLIS","6 - SÃO PAULO INTERIOR E PARANÁ"]
[11,null,"BOSQUE DA SAUDE","2 - SÃO PAULO CAPITAL II\n(Zona Leste e Sul)",null,11,null,"ICARAI","9 - RIO DE JANEIRO III\n(Demais localidades)",null,11,"ANHANGABAU","6 - SÃO PAULO INTERIOR E PARANÁ"]
[12,null,"BROOKLIN NOVO","2 - SÃO PAULO CAPITAL II\n(Zona Leste e Sul)",null,12,null,"INGA","9 - RIO DE JANEIRO III\n(Demais localidades)",null,12,"APARECIDA","5 - SÃO PAULO BAIXADA E VALE DO PARAÍBA"]
[13,null,"BROOKLIN PAULISTA","2 - SÃO PAULO CAPITAL II\n(Zona Leste e Sul)",null,13,null,"ITAIPAVA","9 - RIO DE JANEIRO III\n(Demais localidades)",null,13,"ASA NORTE","12 - CENTRO OESTE / NORTE / MG"]
[14,null,"BUTANTA","1 - SÃO PAULO CAPITAL I \n(Zona Oeste)",null,14,null,"JARDIM CAMPOMAR","9 - RIO DE JANEIRO III\n(Demais localidades)",null,14,"ASA SUL","12 - CENTRO OESTE / NORTE / MG"]
[15,null,"CAMBUCI","3 - SÃO PAULO CAPITAL III\n(Zona Norte e Central)",null,15,null,"JARDIM EXCELSIOR","9 - RIO DE JANEIRO III\n(Demais localidades)",null,15,"ASSUNCAO","4 - GRANDE SÃO PAULO \n(Abc, Guarulhos, Osasco, e demais localidades)"]
[16,null,"CAMPO BELO","2 - SÃO PAULO CAPITAL II\n(Zona Leste e Sul)",null,16,null,"LEBLON","8 - RIO DE JANEIRO II\n(Zona Sul)",null,16,"BAETA NEVES","4 - GRANDE SÃO PAULO \n(Abc, Guarulhos, Osasco, e demais localidades)"]
[17,null,"CAMPOS ELISEOS","3 - SÃO PAULO CAPITAL III\n(Zona Norte e Central)",null,17,null,"LINDO PARQUE","9 - RIO DE JANEIRO III\n(Demais localidades)",null,17,"BAIRRO DAS PALMEIRAS","6 - SÃO PAULO INTERIOR E PARANÁ"]
[18,null,"CARANDIRU","3 - SÃO PAULO CAPITAL III\n(Zona Norte e Central)",null,18,null,"PENHA","9 - RIO DE JANEIRO III\n(Demais localidades)",null,18,"BAIRRO DOS PRADOS","5 - SÃO PAULO BAIXADA E VALE DO PARAÍBA"]
[19,null,"CASA VERDE","3 - SÃO PAULO CAPITAL III\n(Zona Norte e Central)",null,19,null,"PENHA CIRCULAR","9 - RIO DE JANEIRO III\n(Demais localidades)",null,19,"BAIRRO NOVO","10 - NORDESTE I\n(Bahia, Pernambuco, Sergipe e Alagoas)"]
[20,null,"CENTRO","3 - SÃO PAULO CAPITAL III\n(Zona Norte e Central)",null,20,null,"PIRATININGA","9 - RIO DE JANEIRO III\n(Demais localidades)",null,20,"BALNEARIO PRAIA DO PERNAMBUCO","5 - SÃO PAULO BAIXADA E VALE DO PARAÍBA"]
[21,null,"CERQUEIRA CESAR","3 - SÃO PAULO CAPITAL III\n(Zona Norte e Central)",null,21,null,"QUITANDINHA","9 - RIO DE JANEIRO III\n(Demais localidades)",null,21,"BARAO GERALDO","6 - SÃO PAULO INTERIOR E PARANÁ"]
[22,null,"CHACARA BELENZINHO","2 - SÃO PAULO CAPITAL II\n(Zona Leste e Sul)",null,22,null,"RIO COMPRIDO","7 - RIO DE JANEIRO I \n(Centro e Tijuca)",null,22,"BARRA DA LAGOA","5 - SÃO PAULO BAIXADA E VALE DO PARAÍBA"]
[23,null,"CHACARA MARIA TRINDADE","3 - SÃO PAULO CAPITAL III\n(Zona Norte e Central)",null,23,null,"RIVIERA FLUMINENSE","9 - RIO DE JANEIRO III\n(Demais localidades)",null,23,"BETHAVILLE I","4 - GRANDE SÃO PAULO \n(Abc, Guarulhos, Osasco, e demais localidades)"]
[24,null,"CHACARA SANTO ANTONIO (ZONA SUL)","2 - SÃO PAULO CAPITAL II\n(Zona Leste e Sul)",null,24,null,"ROCHA MIRANDA","9 - RIO DE JANEIRO III\n(Demais localidades)",null,24,"BOA VIAGEM","10 - NORDESTE I\n(Bahia, Pernambuco, Sergipe e Alagoas)"]
[25,null,"CIDADE ADEMAR","2 - SÃO PAULO CAPITAL II\n(Zona Leste e Sul)",null,25,null,"SANTA CRUZ","7 - RIO DE JANEIRO I \n(Centro e Tijuca)",null,25,"BOA VISTA","4 - GRANDE SÃO PAULO \n(Abc, Guarulhos, Osasco, e demais localidades)"]
[26,null,"CIDADE JARDIM","1 - SÃO PAULO CAPITAL I \n(Zona Oeste)",null,26,null,"SANTO ANTONIO DA SERRA","9 - RIO DE JANEIRO III\n(Demais localidades)",null,26,"BOICUCANGA","5 - SÃO PAULO BAIXADA E VALE DO PARAÍBA"]
[27,null,"CIDADE MAE DO CEU","2 - SÃO PAULO CAPITAL II\n(Zona Leste e Sul)",null,27,null,"SAO CRISTOVAO","7 - RIO DE JANEIRO I \n(Centro e Tijuca)",null,27,"BONFIM","6 - SÃO PAULO INTERIOR E PARANÁ"]
[28,null,"CIDADE MONCOES","2 - SÃO PAULO CAPITAL II\n(Zona Leste e Sul)",null,28,null,"TIJUCA","9 - RIO DE JANEIRO III\n(Demais localidades)",null,28,"BOQUEIRAO","5 - SÃO PAULO BAIXADA E VALE DO PARAÍBA"]
[29,null,"CITY AMERICA","3 - SÃO PAULO CAPITAL III\n(Zona Norte e Central)",null,29,null,"VARZEA","9 - RIO DE JANEIRO III\n(Demais localidades)",null,29,"BOSQUE","6 - SÃO PAULO INTERIOR E PARANÁ"]
[30,null,"CONJUNTO RESIDENCIAL JOSE BONIFACIO","2 - SÃO PAULO CAPITAL II\n(Zona Leste e Sul)",null,30,null,"VILA DA PENHA","9 - RIO DE JANEIRO III\n(Demais localidades)",null,30,"BOTAFOGO","6 - SÃO PAULO INTERIOR E PARANÁ"]
[31,null,"CONSOLACAO","3 - SÃO PAULO CAPITAL III\n(Zona Norte e Central)",null,31,null,"VILA ISABEL","9 - RIO DE JANEIRO III\n(Demais localidades)",null,31,"CAICARA","5 - SÃO PAULO BAIXADA E VALE DO PARAÍBA"]
[32,null,"ERMELINO MATARAZZO","2 - SÃO PAULO CAPITAL II\n(Zona Leste e Sul)",null,32,null,"VILA VALQUEIRE","7 - RIO DE JANEIRO I \n(Centro e Tijuca)",null,32,"CAMBUI","6 - SÃO PAULO INTERIOR E PARANÁ"]
[33,null,"GUAIANAZES","2 - SÃO PAULO CAPITAL II\n(Zona Leste e Sul)",null,33,null,"VISTA ALEGRE","9 - RIO DE JANEIRO III\n(Demais localidades)",null,33,"CAMPESTRE","4 - GRANDE SÃO PAULO \n(Abc, Guarulhos, Osasco, e demais localidades)"]
[34,null,"HIGIENOPOLIS","3 - SÃO PAULO CAPITAL III\n(Zona Norte e Central)",null,34,null,null,null,null,34,"CANDEIAS","10 - NORDESTE I\n(Bahia, Pernambuco, Sergipe e Alagoas)"]
[35,null,"IMIRIM","3 - SÃO PAULO CAPITAL III\n(Zona Norte e Central)",null,35,null,null,null,null,35,"CANTO DO FORTE","5 - SÃO PAULO BAIXADA E VALE DO PARAÍBA"]
[36,null,"INDIANOPOLIS","2 - SÃO PAULO CAPITAL II\n(Zona Leste e Sul)",null,36,null,null,null,null,36,"CENTRO","6 - SÃO PAULO INTERIOR E PARANÁ"]
[37,null,"IPIRANGA","3 - SÃO PAULO CAPITAL III\n(Zona Norte e Central)",null,37,null,null,null,null,37,"CHACARA ONDAS VERDES","4 - GRANDE SÃO PAULO \n(Abc, Guarulhos, Osasco, e demais localidades)"]
[38,null,"ITABERABA","3 - SÃO PAULO CAPITAL III\n(Zona Norte e Central)",null,38,null,null,null,null,38,"CHACARA PRIMAVERA","6 - SÃO PAULO INTERIOR E PARANÁ"]
[39,null,"ITAIM BIBI","1 - SÃO PAULO CAPITAL I \n(Zona Oeste)",null,39,null,null,null,null,39,"CHICO DE PAULA","5 - SÃO PAULO BAIXADA E VALE DO PARAÍBA"]
[40,null,"ITAQUERA","2 - SÃO PAULO CAPITAL II\n(Zona Leste e Sul)",null,40,null,null,null,null,40,"CIDADE ALTA","6 - SÃO PAULO INTERIOR E PARANÁ"]
[41,null,"JABAQUARA","2 - SÃO PAULO CAPITAL II\n(Zona Leste e Sul)",null,41,null,null,null,null,41,"CIDADE INDUSTRIAL SATELITE DE SAO PAULO","4 - GRANDE SÃO PAULO \n(Abc, Guarulhos, Osasco, e demais localidades)"]
[42,null,"JAGUARE","1 - SÃO PAULO CAPITAL I \n(Zona Oeste)",null,42,null,null,null,null,42,"CIDADE NOVA","6 - SÃO PAULO INTERIOR E PARANÁ"]
[43,null,"JARDIM ALZIRA","2 - SÃO PAULO CAPITAL II\n(Zona Leste e Sul)",null,43,null,null,null,null,43,"CIDADE TAMBORE","4 - GRANDE SÃO PAULO \n(Abc, Guarulhos, Osasco, e demais localidades)"]
[44,null,"JARDIM AMERICA DA PENHA","2 - SÃO PAULO CAPITAL II\n(Zona Leste e Sul)",null,44,null,null,null,null,44,"CONCEICAO","4 - GRANDE SÃO PAULO \n(Abc, Guarulhos, Osasco, e demais localidades)"]
[45,null,"JARDIM AMPLIACAO","2 - SÃO PAULO CAPITAL II\n(Zona Leste e Sul)",null,45,null,null,null,null,45,"CONDOMINIO GUAPORE 1","6 - SÃO PAULO INTERIOR E PARANÁ"]
[46,null,"JARDIM BRASIL (ZONA NORTE)","3 - SÃO PAULO CAPITAL III\n(Zona Norte e Central)",null,46,null,null,null,null,46,"CORDEIRO","10 - NORDESTE I\n(Bahia, Pernambuco, Sergipe e Alagoas)"]
[47,null,"JARDIM COTINHA","2 - SÃO PAULO CAPITAL II\n(Zona Leste e Sul)",null,47,null,null,null,null,47,"CRUZ","6 - SÃO PAULO INTERIOR E PARANÁ"]
[48,null,"JARDIM DAS FLORES","2 - SÃO PAULO CAPITAL II\n(Zona Leste e Sul)",null,48,null,null,null,null,48,"DEMARCHI","4 - GRANDE SÃO PAULO \n(Abc, Guarulhos, Osasco, e demais localidades)"]
[49,null,"JARDIM ESTER YOLANDA","1 - SÃO PAULO CAPITAL I \n(Zona Oeste)",null,49,null,null,null,null,49,"DISTRITO INDUSTRIAL DIPER","10 - NORDESTE I\n(Bahia, Pernambuco, Sergipe e Alagoas)"]
[50,null,"JARDIM FLORESTA","2 - SÃO PAULO CAPITAL II\n(Zona Leste e Sul)",null,50,null,null,null,null,50,"EDSON QUEIROZ","11 - NORDESTE II\n(Rio Grande do Norte, Ceará, Piauí, e Paraíba)"]
[51,null,"JARDIM ITAPEMIRIM","2 - SÃO PAULO CAPITAL II\n(Zona Leste e Sul)",null,51,null,null,null,null,51,"EMBARE","5 - SÃO PAULO BAIXADA E VALE DO PARAÍBA"]
[52,null,"JARDIM ITAPEVA","2 - SÃO PAULO CAPITAL II\n(Zona Leste e Sul)",null,52,null,null,null,null,52,"ENCRUZILHADA","5 - SÃO PAULO BAIXADA E VALE DO PARAÍBA"]
[53,null,"JARDIM MONTE ALEGRE (ZONA NORTE)","3 - SÃO PAULO CAPITAL III\n(Zona Norte e Central)",null,53,null,null,null,null,53,"ENSEADA","5 - SÃO PAULO BAIXADA E VALE DO PARAÍBA"]
[54,null,"JARDIM MONTE KEMEL","1 - SÃO PAULO CAPITAL I \n(Zona Oeste)",null,54,null,null,null,null,54,"ESPINHEIRO","10 - NORDESTE I\n(Bahia, Pernambuco, Sergipe e Alagoas)"]
[55,null,"JARDIM MORUMBI","1 - SÃO PAULO CAPITAL I \n(Zona Oeste)",null,55,null,null,null,null,55,"FATIMA","11 - NORDESTE II\n(Rio Grande do Norte, Ceará, Piauí, e Paraíba)"]
[56,null,"JARDIM PARAISO","3 - SÃO PAULO CAPITAL III\n(Zona Norte e Central)",null,56,null,null,null,null,56,"GONZAGA","5 - SÃO PAULO BAIXADA E VALE DO PARAÍBA"]
[57,null,"JARDIM PAULISTA","1 - SÃO PAULO CAPITAL I \n(Zona Oeste)",null,57,null,null,null,null,57,"GRACAS","10 - NORDESTE I\n(Bahia, Pernambuco, Sergipe e Alagoas)"]
[58,null,"JARDIM PAULISTANO","1 - SÃO PAULO CAPITAL I \n(Zona Oeste)",null,58,null,null,null,null,58,"GRANJA VIANA","4 - GRANDE SÃO PAULO \n(Abc, Guarulhos, Osasco, e demais localidades)"]
[59,null,"JARDIM PRUDENCIA","2 - SÃO PAULO CAPITAL II\n(Zona Leste e Sul)",null,59,null,null,null,null,59,"GRANJA VIANA II","4 - GRANDE SÃO PAULO \n(Abc, Guarulhos, Osasco, e demais localidades)"]
[60,null,"JARDIM RINCAO","3 - SÃO PAULO CAPITAL III\n(Zona Norte e Central)",null,60,null,null,null,null,60,"GUARA I","12 - CENTRO OESTE / NORTE / MG"]
[61,null,"JARDIM SANTA TEREZINHA (ZONA LESTE)","2 - SÃO PAULO CAPITAL II\n(Zona Leste e Sul)",null,61,null,null,null,null,61,"GUILHERMINA","5 - SÃO PAULO BAIXADA E VALE DO PARAÍBA"]
[62,null,"JARDIM SANTO ELIAS","3 - SÃO PAULO CAPITAL III\n(Zona Norte e Central)",null,62,null,null,null,null,62,"HELENA MARIA","4 - GRANDE SÃO PAULO \n(Abc, Guarulhos, Osasco, e demais localidades)"]
[63,null,"JARDIM SAO BERNARDO","2 - SÃO PAULO CAPITAL II\n(Zona Leste e Sul)",null,63,null,null,null,null,63,"ILHA DO LEITE","10 - NORDESTE I\n(Bahia, Pernambuco, Sergipe e Alagoas)"]
[64,null,"JARDIM SAO LUIS","2 - SÃO PAULO CAPITAL II\n(Zona Leste e Sul)",null,64,null,null,null,null,64,"INDEPENDENCIA","5 - SÃO PAULO BAIXADA E VALE DO PARAÍBA"]
[65,null,"JARDIM SAO NICOLAU","2 - SÃO PAULO CAPITAL II\n(Zona Leste e Sul)",null,65,null,null,null,null,65,"INDUSTRIAL ANHANGUERA","4 - GRANDE SÃO PAULO \n(Abc, Guarulhos, Osasco, e demais localidades)"]
[66,null,"JARDIM VILA MARIANA","2 - SÃO PAULO CAPITAL II\n(Zona Leste e Sul)",null,66,null,null,null,null,66,"ININGA","11 - NORDESTE II\n(Rio Grande do Norte, Ceará, Piauí, e Paraíba)"]
[67,null,"LAUZANE PAULISTA","3 - SÃO PAULO CAPITAL III\n(Zona Norte e Central)",null,67,null,null,null,null,67,"ITARARE","5 - SÃO PAULO BAIXADA E VALE DO PARAÍBA"]
[68,null,"LIBERDADE","3 - SÃO PAULO CAPITAL III\n(Zona Norte e Central)",null,68,null,null,null,null,68,"JARDIM","4 - GRANDE SÃO PAULO \n(Abc, Guarulhos, Osasco, e demais localidades)"]
[69,null,"LIMAO","3 - SÃO PAULO CAPITAL III\n(Zona Norte e Central)",null,69,null,null,null,null,69,"JARDIM AMERICA","6 - SÃO PAULO INTERIOR E PARANÁ"]
[70,null,"LIMOEIRO","3 - SÃO PAULO CAPITAL III\n(Zona Norte e Central)",null,70,null,null,null,null,70,"JARDIM ARMENIA","4 - GRANDE SÃO PAULO \n(Abc, Guarulhos, Osasco, e demais localidades)"]
[71,null,"MIRANDOPOLIS","2 - SÃO PAULO CAPITAL II\n(Zona Leste e Sul)",null,71,null,null,null,null,71,"JARDIM ASTRO","6 - SÃO PAULO INTERIOR E PARANÁ"]
[72,null,"MOEMA","3 - SÃO PAULO CAPITAL III\n(Zona Norte e Central)",null,72,null,null,null,null,72,"JARDIM BOA ESPERANCA (VICENTE DE CARVALHO)","5 - SÃO PAULO BAIXADA E VALE DO PARAÍBA"]
[73,null,"MOOCA","2 - SÃO PAULO CAPITAL II\n(Zona Leste e Sul)",null,73,null,null,null,null,73,"JARDIM BOTANICO","6 - SÃO PAULO INTERIOR E PARANÁ"]
[74,null,"PACAEMBU","1 - SÃO PAULO CAPITAL I \n(Zona Oeste)",null,74,null,null,null,null,74,"JARDIM BRASIL","6 - SÃO PAULO INTERIOR E PARANÁ"]
[75,null,"PARADA INGLESA","3 - SÃO PAULO CAPITAL III\n(Zona Norte e Central)",null,75,null,null,null,null,75,"JARDIM CANADA","6 - SÃO PAULO INTERIOR E PARANÁ"]
[76,null,"PARAISO","2 - SÃO PAULO CAPITAL II\n(Zona Leste e Sul)",null,76,null,null,null,null,76,"JARDIM CASQUEIRO","5 - SÃO PAULO BAIXADA E VALE DO PARAÍBA"]
[77,null,"PARAISO DO MORUMBI","1 - SÃO PAULO CAPITAL I \n(Zona Oeste)",null,77,null,null,null,null,77,"JARDIM CIDADE UNIVERSITARIA","11 - NORDESTE II\n(Rio Grande do Norte, Ceará, Piauí, e Paraíba)"]
[78,null,"PARQUE ARTUR ALVIM","2 - SÃO PAULO CAPITAL II\n(Zona Leste e Sul)",null,78,null,null,null,null,78,"JARDIM DAS COLINAS","5 - SÃO PAULO BAIXADA E VALE DO PARAÍBA"]
[79,null,"PARQUE BOTURUSSU","2 - SÃO PAULO CAPITAL II\n(Zona Leste e Sul)",null,79,null,null,null,null,79,"JARDIM DAS NACOES","5 - SÃO PAULO BAIXADA E VALE DO PARAÍBA"]
[80,null,"PARQUE BRASIL","2 - SÃO PAULO CAPITAL II\n(Zona Leste e Sul)",null,80,null,null,null,null,80,"JARDIM DE LUCCA","6 - SÃO PAULO INTERIOR E PARANÁ"]
[81,null,"PARQUE CISPER","2 - SÃO PAULO CAPITAL II\n(Zona Leste e Sul)",null,81,null,null,null,null,81,"JARDIM DO GOLF I","4 - GRANDE SÃO PAULO \n(Abc, Guarulhos, Osasco, e demais localidades)"]
[82,null,"PARQUE CONTINENTAL","1 - SÃO PAULO CAPITAL I \n(Zona Oeste)",null,82,null,null,null,null,82,"JARDIM EMILIA","6 - SÃO PAULO INTERIOR E PARANÁ"]
[83,null,"PARQUE DA MOOCA","2 - SÃO PAULO CAPITAL II\n(Zona Leste e Sul)",null,83,null,null,null,null,83,"JARDIM ESPLANADA","5 - SÃO PAULO BAIXADA E VALE DO PARAÍBA"]
[84,null,"PARQUE DO LAGO","2 - SÃO PAULO CAPITAL II\n(Zona Leste e Sul)",null,84,null,null,null,null,84,"JARDIM ESPLANADA II","5 - SÃO PAULO BAIXADA E VALE DO PARAÍBA"]
[85,null,"PARQUE IMPERIAL","3 - SÃO PAULO CAPITAL III\n(Zona Norte e Central)",null,85,null,null,null,null,85,"JARDIM EULALIA","5 - SÃO PAULO BAIXADA E VALE DO PARAÍBA"]
[86,null,"PARQUE NOVO MUNDO","3 - SÃO PAULO CAPITAL III\n(Zona Norte e Central)",null,86,null,null,null,null,86,"JARDIM EUROPA","6 - SÃO PAULO INTERIOR E PARANÁ"]
[87,null,"PENHA DE FRANCA","2 - SÃO PAULO CAPITAL II\n(Zona Leste e Sul)",null,null,null,null,null,null,87,"JARDIM FLAMBOYANT","6 - SÃO PAULO INTERIOR E PARANÁ"]
[88,null,"PERDIZES","1 - SÃO PAULO CAPITAL I \n(Zona Oeste)",null,null,null,null,null,null,88,"JARDIM FLOR DA MONTANHA","4 - GRANDE SÃO PAULO \n(Abc, Guarulhos, Osasco, e demais localidades)"]
[89,null,"PINHEIROS","1 - SÃO PAULO CAPITAL I \n(Zona Oeste)",null,null,null,null,null,null,89,"JARDIM GOIAS","12 - CENTRO OESTE / NORTE / MG"]
[90,null,"PLANALTO PAULISTA","2 - SÃO PAULO CAPITAL II\n(Zona Leste e Sul)",null,null,null,null,null,null,90,"JARDIM GUANABARA","6 - SÃO PAULO INTERIOR E PARANÁ"]
[91,null,"REAL PARQUE","1 - SÃO PAULO CAPITAL I \n(Zona Oeste)",null,null,null,null,null,null,91,"JARDIM JULIANA","6 - SÃO PAULO INTERIOR E PARANÁ"]
[92,null,"REPUBLICA","3 - SÃO PAULO CAPITAL III\n(Zona Norte e Central)",null,null,null,null,null,null,92,"JARDIM LAS PALMAS","5 - SÃO PAULO BAIXADA E VALE DO PARAÍBA"]
[93,null,"RIO PEQUENO","1 - SÃO PAULO CAPITAL I \n(Zona Oeste)",null,null,null,null,null,null,93,"JARDIM MARIA BRUSCHI MODENEIS","6 - SÃO PAULO INTERIOR E PARANÁ"]
[94,null,"SANTA CECILIA","3 - SÃO PAULO CAPITAL III\n(Zona Norte e Central)",null,null,null,null,null,null,94,"JARDIM MARIA ROSA","4 - GRANDE SÃO PAULO \n(Abc, Guarulhos, Osasco, e demais localidades)"]
[95,null,"SANTA TERESINHA","3 - SÃO PAULO CAPITAL III\n(Zona Norte e Central)",null,null,null,null,null,null,95,"JARDIM NOVA ALIANCA SUL","6 - SÃO PAULO INTERIOR E PARANÁ"]
[96,null,"SANTANA","3 - SÃO PAULO CAPITAL III\n(Zona Norte e Central)",null,null,null,null,null,null,96,"JARDIM PAIQUERE","6 - SÃO PAULO INTERIOR E PARANÁ"]
[97,null,"SANTO AMARO","2 - SÃO PAULO CAPITAL II\n(Zona Leste e Sul)",null,null,null,null,null,null,97,"JARDIM PASSARGADA I","4 - GRANDE SÃO PAULO \n(Abc, Guarulhos, Osasco, e demais localidades)"]
[98,null,"SAO JOAO CLIMACO","2 - SÃO PAULO CAPITAL II\n(Zona Leste e Sul)",null,null,null,null,null,null,98,"JARDIM PAULISTA","6 - SÃO PAULO INTERIOR E PARANÁ"]
[99,null,"SAPOPEMBA","3 - SÃO PAULO CAPITAL III\n(Zona Norte e Central)",null,null,null,null,null,null,99,"JARDIM PROENCA","6 - SÃO PAULO INTERIOR E PARANÁ"]
[100,null,"SAUDE","2 - SÃO PAULO CAPITAL II\n(Zona Leste e Sul)",null,null,null,null,null,null,100,"JARDIM RIO BRANCO","5 - SÃO PAULO BAIXADA E VALE DO PARAÍBA"]
[101,null,"SITIO MORRO GRANDE","3 - SÃO PAULO CAPITAL III\n(Zona Norte e Central)",null,null,null,null,null,null,101,"JARDIM SABAUNA","5 - SÃO PAULO BAIXADA E VALE DO PARAÍBA"]
[102,null,"SUMARE","1 - SÃO PAULO CAPITAL I \n(Zona Oeste)",null,null,null,null,null,null,102,"JARDIM SANTA FRANCISCA","4 - GRANDE SÃO PAULO \n(Abc, Guarulhos, Osasco, e demais localidades)"]
[103,null,"SUMAREZINHO","1 - SÃO PAULO CAPITAL I \n(Zona Oeste)",null,null,null,null,null,null,103,"JARDIM SANTA GENEBRA","6 - SÃO PAULO INTERIOR E PARANÁ"]
[104,null,"TATUAPE","2 - SÃO PAULO CAPITAL II\n(Zona Leste e Sul)",null,null,null,null,null,null,104,"JARDIM SANTA MARIA","5 - SÃO PAULO BAIXADA E VALE DO PARAÍBA"]
[105,null,"TUCURUVI","3 - SÃO PAULO CAPITAL III\n(Zona Norte e Central)",null,null,null,null,null,null,105,"JARDIM SANTA ROSALIA","6 - SÃO PAULO INTERIOR E PARANÁ"]
[106,null,"VILA ALBERTINA","3 - SÃO PAULO CAPITAL III\n(Zona Norte e Central)",null,null,null,null,null,null,106,"JARDIM SAO FRANCISCO","5 - SÃO PAULO BAIXADA E VALE DO PARAÍBA"]
[107,null,"VILA AMELIA","3 - SÃO PAULO CAPITAL III\n(Zona Norte e Central)",null,null,null,null,null,null,107,"JARDIM SOROCABANO","6 - SÃO PAULO INTERIOR E PARANÁ"]
[108,null,"VILA ANASTACIO","3 - SÃO PAULO CAPITAL III\n(Zona Norte e Central)",null,null,null,null,null,null,108,"JARDIM SUMARE","6 - SÃO PAULO INTERIOR E PARANÁ"]
[109,null,"VILA ANDRADE","2 - SÃO PAULO CAPITAL II\n(Zona Leste e Sul)",null,null,null,null,null,null,109,"JARDIM TUPANCI","4 - GRANDE SÃO PAULO \n(Abc, Guarulhos, Osasco, e demais localidades)"]
[110,null,"VILA ARCADIA","3 - SÃO PAULO CAPITAL III\n(Zona Norte e Central)",null,null,null,null,null,null,110,"JARDINS","10 - NORDESTE I\n(Bahia, Pernambuco, Sergipe e Alagoas)"]
[111,null,"VILA AZEVEDO","3 - SÃO PAULO CAPITAL III\n(Zona Norte e Central)",null,null,null,null,null,null,111,"JD RIBAMAR","5 - SÃO PAULO BAIXADA E VALE DO PARAÍBA"]
[112,null,"VILA BUARQUE","3 - SÃO PAULO CAPITAL III\n(Zona Norte e Central)",null,null,null,null,null,null,112,"JOQUEI","11 - NORDESTE II\n(Rio Grande do Norte, Ceará, Piauí, e Paraíba)"]
[113,null,"VILA BUTANTA","1 - SÃO PAULO CAPITAL I \n(Zona Oeste)",null,null,null,null,null,null,113,"JOSE MENINO","5 - SÃO PAULO BAIXADA E VALE DO PARAÍBA"]
[114,null,"VILA CAMPANELA","2 - SÃO PAULO CAPITAL II\n(Zona Leste e Sul)",null,null,null,null,null,null,114,"KM 18","4 - GRANDE SÃO PAULO \n(Abc, Guarulhos, Osasco, e demais localidades)"]
[115,null,"VILA CARMOSINA","2 - SÃO PAULO CAPITAL II\n(Zona Leste e Sul)",null,null,null,null,null,null,115,"LAGEADINHO","4 - GRANDE SÃO PAULO \n(Abc, Guarulhos, Osasco, e demais localidades)"]
[116,null,"VILA CLAUDIA","2 - SÃO PAULO CAPITAL II\n(Zona Leste e Sul)",null,null,null,null,null,null,116,"LIBERDADE","6 - SÃO PAULO INTERIOR E PARANÁ"]
[117,null,"VILA CLEMENTINO","2 - SÃO PAULO CAPITAL II\n(Zona Leste e Sul)",null,null,null,null,null,null,117,"LOTEAMENTO ALPHAVILLE CAMPINAS","6 - SÃO PAULO INTERIOR E PARANÁ"]
[118,null,"VILA CRUZEIRO","2 - SÃO PAULO CAPITAL II\n(Zona Leste e Sul)",null,null,null,null,null,null,118,"LOTEAMENTO VILLA BRANCA","5 - SÃO PAULO BAIXADA E VALE DO PARAÍBA"]
{"$rows_left_out":113}